Reaction Details
TargetMultidrug resistance-associated protein 1
LigandBDBM50465865
Substrate/Competitorn/a
Meas. Tech.ChEMBL_1788926 (CHEMBL4260660)
EC50 95±n/a nM
Citation Wong, ILKZhu, XChan, KFLaw, MCLo, AMYHu, XChow, LMCChan, TH Discovery of Novel Flavonoid Dimers To Reverse Multidrug Resistance Protein 1 (MRP1, ABCC1) Mediated Drug Resistance in Cancers Using a High Throughput Platform with "Click Chemistry". J Med Chem61:9931-9951 (2018) 
 
Multidrug resistance-associated protein 1
Name:Multidrug resistance-associated protein 1
Type:n/a
Mol. Mass.:171597.72
Organism:Homo sapiens (Human)
Description:P33527
Residue:1531
BDBM50465865
NameBDBM50465865
Synonyms:CHEMBL4278382
TypeSmall organic molecule
Emp. Form.C41H36FN3O8
Mol. Mass.717.7382
SMILESFc1ccc2oc(cc(=O)c2c1)-c1ccc(OCCOCCOCCn2cc(CCCOc3ccc4c(c3)oc(cc4=O)-c3ccccc3)nn2)cc1