Reaction Details
TargetCD209 antigen
LigandBDBM50467900
Substrate/Competitorn/a
Meas. Tech.ChEMBL_1797279 (CHEMBL4269396)
IC50 1400000±n/a nM
Citation Ng, SBennett, NJSchulze, JGao, NRademacher, CDerda, R Genetically-encoded fragment-based discovery of glycopeptide ligands for DC-SIGN. Bioorg Med Chem26:5368-5377 (2018) 
 
CD209 antigen
Name:CD209 antigen
Type:PROTEIN
Mol. Mass.:45768.84
Organism:Homo sapiens (Human)
Description:ChEMBL_104194
Residue:404
BDBM50467900
NameBDBM50467900
Synonyms:CHEMBL4281622
TypeSmall organic molecule
Emp. Form.C24H43N3O16
Mol. Mass.629.6087
SMILES[H][C@]1(O[C@H]2[C@H](O)[C@@H](CO[C@H]3O[C@H](CO)[C@@H](O)[C@H](O)[C@@H]3O)O[C@H](OCCCCCCN=[N+]=[N-])[C@H]2O)O[C@H](CO)[C@@H](O)[C@H](O)[C@@H]1O