Reaction Details
TargetCD209 antigen
LigandBDBM50467901
Substrate/Competitorn/a
Meas. Tech.ChEMBL_1797280 (CHEMBL4269397)
IC50 100000±n/a nM
Citation Ng, SBennett, NJSchulze, JGao, NRademacher, CDerda, R Genetically-encoded fragment-based discovery of glycopeptide ligands for DC-SIGN. Bioorg Med Chem26:5368-5377 (2018) 
 
CD209 antigen
Name:CD209 antigen
Type:PROTEIN
Mol. Mass.:45768.84
Organism:Homo sapiens (Human)
Description:ChEMBL_104194
Residue:404
BDBM50467901
NameBDBM50467901
Synonyms:CHEMBL4283127
TypeSmall organic molecule
Emp. Form.C58H98N2O48
Mol. Mass.1591.3833
SMILES[H][C@]1(O[C@H]2[C@@H](O)[C@H](O)[C@@H](CO)O[C@@H]2OC[C@H]2O[C@H](OC[C@H]3O[C@H](NC(=O)C[C@H](N)C(O)=O)[C@@H](O)[C@@H](O[C@@]4([H])O[C@H](CO)[C@@H](O)[C@H](O)[C@@H]4O[C@@]4([H])O[C@H](CO)[C@@H](O)[C@H](O)[C@@H]4O[C@@]4([H])O[C@H](CO)[C@@H](O)[C@H](O)[C@@H]4O)[C@@H]3O)[C@@H](O)[C@@H](O[C@@]3([H])O[C@H](CO)[C@@H](O)[C@H](O)[C@@H]3O[C@@]3([H])O[C@H](CO)[C@@H](O)[C@H](O)[C@@H]3O)[C@@H]2O)O[C@H](CO)[C@@H](O)[C@H](O)[C@@H]1O