Reaction Details
TargetCD209 antigen
LigandBDBM50467902
Substrate/Competitorn/a
Meas. Tech.ChEMBL_1797279 (CHEMBL4269396)
IC50 450000±n/a nM
Citation Ng, SBennett, NJSchulze, JGao, NRademacher, CDerda, R Genetically-encoded fragment-based discovery of glycopeptide ligands for DC-SIGN. Bioorg Med Chem26:5368-5377 (2018) 
 
CD209 antigen
Name:CD209 antigen
Type:PROTEIN
Mol. Mass.:45768.84
Organism:Homo sapiens (Human)
Description:ChEMBL_104194
Residue:404
BDBM50467902
NameBDBM50467902
Synonyms:CHEMBL4294737
TypeSmall organic molecule
Emp. Form.C38H61N11O17
Mol. Mass.943.9544
SMILESCC[C@H](C)[C@H](NC(=O)[C@H](CO)NC(=O)\C=N\O[C@H]1O[C@H](CO)[C@@H](O)[C@H](O)[C@@H]1O)C(=O)N[C@@H]([C@@H](C)O)C(=O)N[C@@H](Cc1cnc[nH]1)C(=O)N[C@@H](C)C(=O)N1CCC[C@H]1C(=O)N[C@@H](CO)C(N)=O