Reaction Details
TargetCD209 antigen
LigandBDBM50467903
Substrate/Competitorn/a
Meas. Tech.ChEMBL_1797279 (CHEMBL4269396)
IC50 6400000±n/a nM
Citation Ng, SBennett, NJSchulze, JGao, NRademacher, CDerda, R Genetically-encoded fragment-based discovery of glycopeptide ligands for DC-SIGN. Bioorg Med Chem26:5368-5377 (2018) 
 
CD209 antigen
Name:CD209 antigen
Type:PROTEIN
Mol. Mass.:45768.84
Organism:Homo sapiens (Human)
Description:ChEMBL_104194
Residue:404
BDBM50467903
NameBDBM50467903
Synonyms:CHEBI:28729 | CHEMBL365590
TypeSmall organic molecule
Emp. Form.C6H12O6
Mol. Mass.180.1559
SMILESOC[C@H]1O[C@H](O)[C@@H](O)[C@@H](O)[C@@H]1O