Reaction Details
Target5-hydroxytryptamine receptor 2A
LigandBDBM50469504
Substrate/Competitorn/a
Meas. Tech.ChEMBL_1804290 (CHEMBL4276582)
Ki 0.720000±n/a nM
Citation Cao, XZhang, YChen, YQiu, YYu, MXu, XLiu, XLiu, BFZhang, LZhang, G Synthesis and Biological Evaluation of Fused Tricyclic Heterocycle Piperazine (Piperidine) Derivatives As Potential Multireceptor Atypical Antipsychotics. J Med Chem61:10017-10039 (2018) 
 
5-hydroxytryptamine receptor 2A
Name:5-hydroxytryptamine receptor 2A
Type:G Protein-Coupled Receptor (GPCR)
Mol. Mass.:52852.05
Organism:Rattus norvegicus (rat)
Description:Rat cortex membranes 5-HT2A receptors.
Residue:471
BDBM50469504
NameBDBM50469504
Synonyms:CHEMBL4293999
TypeSmall organic molecule
Emp. Form.C28H30FN3O3
Mol. Mass.475.5545
SMILESFc1ccc2c(noc2c1)C1CCN(CCCCC(=O)c2cc3CCN4c3c(CCC4=O)c2)CC1