Reaction Details
TargetD(3) dopamine receptor
LigandBDBM50469504
Substrate/Competitorn/a
Meas. Tech.ChEMBL_1804295 (CHEMBL4276587)
Ki 1.7±n/a nM
Citation Cao, XZhang, YChen, YQiu, YYu, MXu, XLiu, XLiu, BFZhang, LZhang, G Synthesis and Biological Evaluation of Fused Tricyclic Heterocycle Piperazine (Piperidine) Derivatives As Potential Multireceptor Atypical Antipsychotics. J Med Chem61:10017-10039 (2018) 
 
D(3) dopamine receptor
Name:D(3) dopamine receptor
Type:Protein
Mol. Mass.:49540.58
Organism:Rattus norvegicus (Rat)
Description:P19020
Residue:446
BDBM50469504
NameBDBM50469504
Synonyms:CHEMBL4293999
TypeSmall organic molecule
Emp. Form.C28H30FN3O3
Mol. Mass.475.5545
SMILESFc1ccc2c(noc2c1)C1CCN(CCCCC(=O)c2cc3CCN4c3c(CCC4=O)c2)CC1