Reaction Details
TargetD(2) dopamine receptor
LigandBDBM50469504
Substrate/Competitorn/a
Meas. Tech.ChEMBL_1804288 (CHEMBL4276580)
Ki 2.9±n/a nM
Citation Cao, XZhang, YChen, YQiu, YYu, MXu, XLiu, XLiu, BFZhang, LZhang, G Synthesis and Biological Evaluation of Fused Tricyclic Heterocycle Piperazine (Piperidine) Derivatives As Potential Multireceptor Atypical Antipsychotics. J Med Chem61:10017-10039 (2018) 
 
D(2) dopamine receptor
Name:D(2) dopamine receptor
Type:G Protein-Coupled Receptor (GPCR)
Mol. Mass.:50931.60
Organism:Rattus norvegicus (rat)
Description:P61169
Residue:444
BDBM50469504
NameBDBM50469504
Synonyms:CHEMBL4293999
TypeSmall organic molecule
Emp. Form.C28H30FN3O3
Mol. Mass.475.5545
SMILESFc1ccc2c(noc2c1)C1CCN(CCCCC(=O)c2cc3CCN4c3c(CCC4=O)c2)CC1