Reaction Details
TargetGastrin/cholecystokinin type B receptor
LigandBDBM50470623
Substrate/Competitorn/a
Meas. Tech.ChEMBL_48425 (CHEMBL660353)
Ki 2.3±n/a nM
Citation Kalindjian, SBBuck, IMCushnir, JRDunstone, DJHudson, MLLow, CMMcDonald, IMPether, MJSteel, KITozer, MJ Improving the affinity and selectivity of a nonpeptide series of cholecystokinin-B/gastrin receptor antagonists based on the dibenzobicyclo[2.2.2]octane skeleton. J Med Chem38:4294-302 (1995) 
 
Gastrin/cholecystokinin type B receptor
Name:Gastrin/cholecystokinin type B receptor
Type:Enzyme Catalytic Domain
Mol. Mass.:49196.59
Organism:MOUSE
Description:Cholecystokinin A CCKBR MOUSE::P56481
Residue:453
BDBM50470623
NameBDBM50470623
Synonyms:CHEMBL140179
TypeSmall organic molecule
Emp. Form.C44H43N3O7S
Mol. Mass.757.893
SMILESOC(=O)c1cc(NC(=O)[C@@H](Cc2ccsc2)NC(=O)C2C(C3c4ccccc4C2c2ccccc32)C(=O)NCC23CC4CC(CC(C4)C2)C3)cc(c1)C(O)=O