Reaction Details
TargetGastrin/cholecystokinin type B receptor
LigandBDBM50471066
Substrate/Competitorn/a
Meas. Tech.ChEMBL_48427 (CHEMBL660355)
Ki 0.741310±n/a nM
Citation Kalindjian, SBBuck, IMDavies, JMDunstone, DJHudson, MLLow, CMMcDonald, IMPether, MJSteel, KITozer, MJVinter, JG Non-peptide cholecystokinin-B/gastrin receptor antagonists based on bicyclic, heteroaromatic skeletons. J Med Chem39:1806-15 (1996) 
 
Gastrin/cholecystokinin type B receptor
Name:Gastrin/cholecystokinin type B receptor
Type:Enzyme Catalytic Domain
Mol. Mass.:49196.59
Organism:MOUSE
Description:Cholecystokinin A CCKBR MOUSE::P56481
Residue:453
BDBM50471066
NameBDBM50471066
Synonyms:CHEMBL415936
TypeSmall organic molecule
Emp. Form.C38H37FN4O7
Mol. Mass.680.7214
SMILESOC(=O)c1cc(NC(=O)[C@H](Cc2ccccc2F)NC(=O)c2cc3cc[nH]c3cc2C(=O)NCC23CC4CC(CC(C4)C2)C3)cc(c1)C(O)=O