Reaction Details
TargetGastrin/cholecystokinin type B receptor
LigandBDBM50471075
Substrate/Competitorn/a
Meas. Tech.ChEMBL_48427 (CHEMBL660355)
Ki 1.2±n/a nM
Citation Kalindjian, SBBuck, IMDavies, JMDunstone, DJHudson, MLLow, CMMcDonald, IMPether, MJSteel, KITozer, MJVinter, JG Non-peptide cholecystokinin-B/gastrin receptor antagonists based on bicyclic, heteroaromatic skeletons. J Med Chem39:1806-15 (1996) 
 
Gastrin/cholecystokinin type B receptor
Name:Gastrin/cholecystokinin type B receptor
Type:Enzyme Catalytic Domain
Mol. Mass.:49196.59
Organism:MOUSE
Description:Cholecystokinin A CCKBR MOUSE::P56481
Residue:453
BDBM50471075
NameBDBM50471075
Synonyms:CHEMBL299540
TypeSmall organic molecule
Emp. Form.C38H38N12O3
Mol. Mass.710.7869
SMILESO=C(Nc1cc(cc(c1)-c1nn[nH]n1)-c1nn[nH]n1)[C@H](Cc1ccccc1)NC(=O)c1cc2cc[nH]c2cc1C(=O)NCC12CC3CC(CC(C3)C1)C2