Reaction Details
TargetMu-type opioid receptor
LigandBDBM50027791
Substrate/Competitorn/a
Meas. Tech.ChEBML_146973
IC50 9.8±n/a nM
Citation Rice, KCKonicki, PEQuirion, RBurke, TRPert, CB Synthesis and pharmacological characterization of (+/-)-5,9 alpha-dimethyl-2-[2-(4-fluorophenyl)ethyl]-2'-hydroxy-6,7-benzomorphan (fluorophen), a ligand suitable for visualization of opiate receptors in vivo. J Med Chem26:1643-5 (1983) Mu-type opioid receptor
Name:Mu-type opioid receptor
Type:Enzyme Catalytic Domain
Mol. Mass.:11165.58
Organism:GUINEA PIG
Description:P97266
Residue:98
BDBM50027791
NameBDBM50027791
Synonyms:6,11-Dimethyl-3-phenethyl-1,2,3,4,5,6-hexahydro-2,6-methano-benzo[d]azocin-8-ol(phenazocine) PHENAZOCINE
TypeSmall organic molecule
Emp. Form.C22H27NO
Mol. Mass.321.4559
SMILESCC1C2Cc3ccc(O)cc3C1(C)CCN2CCc1ccccc1