Reaction Details
TargetMelanin-concentrating hormone receptor 1
LigandBDBM50475921
Substrate/Competitorn/a
Meas. Tech.ChEMBL_402702 (CHEMBL908624)
Ki 316±n/a nM
Citation Witty, DRBateson, JHervieu, GJAl-Barazanji, KJeffrey, PHamprecht, DHaynes, AJohnson, CNMuir, AIO'Hanlon, PJStemp, GStevens, AJThewlis, KWinborn, KY Discovery of potent and stable conformationally constrained analogues of the MCH R1 antagonist SB-568849. Bioorg Med Chem Lett16:4872-8 (2006) 
 
Melanin-concentrating hormone receptor 1
Name:Melanin-concentrating hormone receptor 1
Type:G Protein-Coupled Receptor (GPCR)
Mol. Mass.:45976.27
Organism:Homo sapiens (Human)
Description:Membranes from CHO-K1 cells stably expressing human MCH1R were used in assays.
Residue:422
BDBM50475921
NameBDBM50475921
Synonyms:CHEMBL214941
TypeSmall organic molecule
Emp. Form.C30H36N2O2
Mol. Mass.456.619
SMILESCC(C)N(CCOc1ccc(cc1)N(C)C(=O)c1ccc-2c(CCc3ccccc-23)c1)C(C)C