Reaction Details
TargetMelanin-concentrating hormone receptor 1
LigandBDBM50422930
Substrate/Competitorn/a
Meas. Tech.ChEMBL_402702 (CHEMBL908624)
Ki 20±n/a nM
Citation Witty, DRBateson, JHervieu, GJAl-Barazanji, KJeffrey, PHamprecht, DHaynes, AJohnson, CNMuir, AIO'Hanlon, PJStemp, GStevens, AJThewlis, KWinborn, KY Discovery of potent and stable conformationally constrained analogues of the MCH R1 antagonist SB-568849. Bioorg Med Chem Lett16:4872-8 (2006) 
 
Melanin-concentrating hormone receptor 1
Name:Melanin-concentrating hormone receptor 1
Type:G Protein-Coupled Receptor (GPCR)
Mol. Mass.:45976.27
Organism:Homo sapiens (Human)
Description:Membranes from CHO-K1 cells stably expressing human MCH1R were used in assays.
Residue:422
BDBM50422930
NameBDBM50422930
Synonyms:CHEMBL214276
TypeSmall organic molecule
Emp. Form.C25H25N3O3S
Mol. Mass.447.549
SMILESCOc1cc(ccc1OCCN1CCCC1)-n1cnc2cc(sc2c1=O)-c1ccccc1