Reaction Details
TargetMelanin-concentrating hormone receptor 1
LigandBDBM50475937
Substrate/Competitorn/a
Meas. Tech.ChEMBL_402702 (CHEMBL908624)
Ki 200±n/a nM
Citation Witty, DRBateson, JHervieu, GJAl-Barazanji, KJeffrey, PHamprecht, DHaynes, AJohnson, CNMuir, AIO'Hanlon, PJStemp, GStevens, AJThewlis, KWinborn, KY Discovery of potent and stable conformationally constrained analogues of the MCH R1 antagonist SB-568849. Bioorg Med Chem Lett16:4872-8 (2006) 
 
Melanin-concentrating hormone receptor 1
Name:Melanin-concentrating hormone receptor 1
Type:G Protein-Coupled Receptor (GPCR)
Mol. Mass.:45976.27
Organism:Homo sapiens (Human)
Description:Membranes from CHO-K1 cells stably expressing human MCH1R were used in assays.
Residue:422
BDBM50475937
NameBDBM50475937
Synonyms:CHEMBL215614
TypeSmall organic molecule
Emp. Form.C28H30N2O3
Mol. Mass.442.5494
SMILESCC(C)N(CCOc1ccc(NC(=O)c2ccc3-c4ccccc4C(=O)c3c2)cc1)C(C)C