Reaction Details
TargetMelanin-concentrating hormone receptor 1
LigandBDBM50475942
Substrate/Competitorn/a
Meas. Tech.ChEMBL_402702 (CHEMBL908624)
Ki 40±n/a nM
Citation Witty, DRBateson, JHervieu, GJAl-Barazanji, KJeffrey, PHamprecht, DHaynes, AJohnson, CNMuir, AIO'Hanlon, PJStemp, GStevens, AJThewlis, KWinborn, KY Discovery of potent and stable conformationally constrained analogues of the MCH R1 antagonist SB-568849. Bioorg Med Chem Lett16:4872-8 (2006) 
 
Melanin-concentrating hormone receptor 1
Name:Melanin-concentrating hormone receptor 1
Type:G Protein-Coupled Receptor (GPCR)
Mol. Mass.:45976.27
Organism:Homo sapiens (Human)
Description:Membranes from CHO-K1 cells stably expressing human MCH1R were used in assays.
Residue:422
BDBM50475942
NameBDBM50475942
Synonyms:CHEMBL214081
TypeSmall organic molecule
Emp. Form.C26H26N4O4
Mol. Mass.458.509
SMILESCOc1cc(ccc1OCCN1CCCC1)-n1nnc2ccc(Oc3ccccc3)cc2c1=O