Reaction Details
TargetMelanin-concentrating hormone receptor 1
LigandBDBM50475944
Substrate/Competitorn/a
Meas. Tech.ChEMBL_402702 (CHEMBL908624)
Ki 50±n/a nM
Citation Witty, DRBateson, JHervieu, GJAl-Barazanji, KJeffrey, PHamprecht, DHaynes, AJohnson, CNMuir, AIO'Hanlon, PJStemp, GStevens, AJThewlis, KWinborn, KY Discovery of potent and stable conformationally constrained analogues of the MCH R1 antagonist SB-568849. Bioorg Med Chem Lett16:4872-8 (2006) 
 
Melanin-concentrating hormone receptor 1
Name:Melanin-concentrating hormone receptor 1
Type:G Protein-Coupled Receptor (GPCR)
Mol. Mass.:45976.27
Organism:Homo sapiens (Human)
Description:Membranes from CHO-K1 cells stably expressing human MCH1R were used in assays.
Residue:422
BDBM50475944
NameBDBM50475944
Synonyms:CHEMBL212487
TypeSmall organic molecule
Emp. Form.C27H34N2O3
Mol. Mass.434.5705
SMILESCOc1cc(NC(=O)c2ccc(cc2)C2CCCCC2)ccc1OC12CCN(C1)CCC2