Reaction Details
TargetProtease
LigandBDBM50067593
Substrate/Competitorn/a
Meas. Tech.ChEMBL_457204 (CHEMBL940805)
IC50 0.600000±n/a nM
Citation Raghavan, SLu, ZBeeson, TChapman, KTSchleif, WAOlsen, DBStahlhut, MRutkowski, CAGabryelski, LEmini, ETata, JR Synthesis of novel HIV protease inhibitors (PI) with activity against PI-resistant virus. Bioorg Med Chem Lett17:5432-6 (2007) 
 
Protease
Name:Protease
Synonyms:n/a
Type:Enzyme
Mol. Mass.:10904.79
Organism:Human immunodeficiency virus 1 (HIV-1)
Description:Q9YQ12
Residue:99
BDBM50067593
NameBDBM50067593
TypeSmall organic molecule
Emp. Form.C36H47N5O4
Mol. Mass.613.7895
SMILESCC(C)(C)NC(=O)[C@@H]1CN(Cc2cccnc2)CCN1C[C@@H](O)C[C@@H](Cc1ccccc1)C(=O)N[C@@H]1[C@H](O)Cc2ccccc12