Reaction Details
Target5-hydroxytryptamine receptor 2C
LigandBDBM85530
Substrate/Competitorn/a
Meas. Tech.ChEMBL_460519 (CHEMBL926599)
EC50 25±n/a nM
Citation Smith, BMSmith, JMTsai, JHSchultz, JAGilson, CAEstrada, SAChen, RRPark, DMPrieto, EBGallardo, CSSengupta, DDosa, PICovel, JARen, AWebb, RRBeeley, NRMartin, MMorgan, MEspitia, SSaldana, HRBjenning, CWhelan, KTGrottick, AJMenzaghi, FThomsen, WJ Discovery and structure-activity relationship of (1R)-8-chloro-2,3,4,5-tetrahydro-1-methyl-1H-3-benzazepine (Lorcaserin), a selective serotonin 5-HT2C receptor agonist for the treatment of obesity. J Med Chem51:305-13 (2008) 
 
5-hydroxytryptamine receptor 2C
Name:5-hydroxytryptamine receptor 2C
Type:G Protein-Coupled Receptor (GPCR)
Mol. Mass.:51836.79
Organism:Homo sapiens (Human)
Description:P28335
Residue:458
BDBM85530
NameBDBM85530
Synonyms:Nor-d-fenfluramine Norfenfluramine Norfenfluramine (-) | d-Norfenfluramine
TypeSmall organic molecule
Emp. Form.C10H12F3N
Mol. Mass.203.2042
SMILESC[C@H](N)Cc1cccc(c1)C(F)(F)F