Reaction Details
TargetHistamine H4 receptor
LigandBDBM50191289
Substrate/Competitorn/a
Meas. Tech.ChEMBL_475717 (CHEMBL934603)
Ki 25±n/a nM
Citation Smits, RALim, HDHanzer, AZuiderveld, OPGuaita, EAdami, MCoruzzi, GLeurs, Rde Esch, IJ Fragment based design of new H4 receptor-ligands with anti-inflammatory properties in vivo. J Med Chem51:2457-67 (2008) 
 
Histamine H4 receptor
Name:Histamine H4 receptor
Type:G Protein-Coupled Receptor (GPCR)
Mol. Mass.:44517.02
Organism:Homo sapiens (Human)
Description:Binding assays were using CHO cells stably expressing hH4R receptors.
Residue:390
BDBM50191289
NameBDBM50191289
Synonyms:7-chloro-11-(4-methyl-piperazin-1-yl)-dibenzo[b,f][1,4]oxazepine 7-chloro-11-(4-methylpiperazin-1-yl)dibenzo[b,f][1,4]oxazepine VUF-6884
TypeSmall organic molecule
Emp. Form.C18H18ClN3O
Mol. Mass.327.808
SMILESCN1CCN(CC1)C1=Nc2ccc(Cl)cc2Oc2ccccc12