Reaction Details
TargetFatty acid synthase
LigandBDBM50009248
Substrate/Competitorn/a
Meas. Tech.ChEMBL_482197 (CHEMBL960231)
IC50 850±n/a nM
Citation Zhang, ZElSohly, HNLi, XCKhan, SIBroedel, SERaulli, RECihlar, RLWalker, LA Flavanone glycosides from Miconia trailii. J Nat Prod66:39-41 (2003) 
 
Fatty acid synthase
Name:Fatty acid synthase
Type:Enzyme
Mol. Mass.:273419.37
Organism:Homo sapiens (Human)
Description:P49327
Residue:2511
BDBM50009248
NameBDBM50009248
Synonyms:(2R,3S)-3-((4E,7E)-Nona-4,7-dienoyl)-oxirane-2-carboxylic acid amide 3-Nona-4,7-dienoyl-oxirane-2-carboxylic acid amide CERULENIN | CHEMBL45627
TypeSmall organic molecule
Emp. Form.C12H17NO3
Mol. Mass.223.2683
SMILESC\C=C\C\C=C\CCC(=O)[C@H]1O[C@H]1C(N)=O