Reaction Details
TargetReverse transcriptase
LigandBDBM50002692
Substrate/Competitorn/a
Meas. Tech.ChEMBL_541098 (CHEMBL1034081)
IC50 50±n/a nM
Citation Boojamra, CGParrish, JPSperandio, DGao, YPetrakovsky, OVLee, SKMarkevitch, DYVela, JELaflamme, GChen, JMRay, ASBarron, ACSparacino, MLDesai, MCKim, CUCihlar, TMackman, RL Design, synthesis, and anti-HIV activity of 4'-modified carbocyclic nucleoside phosphonate reverse transcriptase inhibitors. Bioorg Med Chem17:1739-46 (2009) 
 
Reverse transcriptase
Name:Reverse transcriptase
Synonyms:n/a
Type:Protein
Mol. Mass.:29598.37
Organism:Human immunodeficiency virus 1
Description:Q9WKE8
Residue:254
BDBM50002692
NameBDBM50002692
TypeSmall organic molecule
Emp. Form.C10H13N5O4
Mol. Mass.267.2413
SMILESCc1cn([C@H]2C[C@H](N=[N+]=[N-])[C@@H](CO)O2)c(=O)[nH]c1=O