Reaction Details
TargetProtease
LigandBDBM8125
Substrate/Competitorn/a
Meas. Tech.ChEMBL_544291 (CHEMBL1020429)
Ki 0.001470±n/a nM
Citation Hazen, RHarvey, RFerris, RCraig, CYates, PGriffin, PMiller, JKaldor, IRay, JSamano, VFurfine, ESpaltenstein, AHale, MTung, RSt Clair, MHanlon, MBoone, L In vitro antiviral activity of the novel, tyrosyl-based human immunodeficiency virus (HIV) type 1 protease inhibitor brecanavir (GW640385) in combination with other antiretrovirals and against a panel of protease inhibitor-resistant HIV. Antimicrob Agents Chemother51:3147-54 (2007) 
 
Protease
Name:Protease
Synonyms:n/a
Type:Enzyme
Mol. Mass.:10904.79
Organism:Human immunodeficiency virus 1 (HIV-1)
Description:Q9YQ12
Residue:99
BDBM8125
NameBDBM8125
TypeSmall organic molecule
Emp. Form.C27H37N3O7S
Mol. Mass.547.664
SMILES[H][C@@]1(CO[C@@]2([H])OCC[C@@]12[H])OC(=O)N[C@@H](Cc1ccccc1)[C@H](O)CN(CC(C)C)S(=O)(=O)c1ccc(N)cc1