Reaction Details
TargetMast/stem cell growth factor receptor Kit
LigandBDBM50501882
Substrate/Competitorn/a
Meas. Tech.ChEMBL_1805750 (CHEMBL4305109)
EC50 77±n/a nM
Citation Liu, XWang, BChen, CQi, ZZou, FWang, JHu, CWang, AGe, JLiu, QYu, KHu, ZJiang, ZWang, WWang, LWang, WRen, TBai, MLiu, QLiu, J Discovery of ( E)- N J Med Chem62:5006-5024 (2019) 
 
Mast/stem cell growth factor receptor Kit
Name:Mast/stem cell growth factor receptor Kit
Type:Protein
Mol. Mass.:109869.37
Organism:Homo sapiens (Human)
Description:P10721
Residue:976
BDBM50501882
NameBDBM50501882
Synonyms:CHEMBL4446361
TypeSmall organic molecule
Emp. Form.C23H18FN5O2
Mol. Mass.415.4197
SMILESFc1cccc(NC(=O)CC(=O)Nc2ccc3c(\C=C\c4ccccn4)n[nH]c3c2)c1