Reaction Details
TargetAldo-keto reductase family 1 member C1
LigandBDBM50330427
Substrate/Competitorn/a
Meas. Tech.ChEMBL_741156 (CHEMBL1764478)
Ki 70±n/a nM
Citation El-Kabbani, ODhagat, USoda, MEndo, SMatsunaga, THara, A Probing the inhibitor selectivity pocket of human 20?-hydroxysteroid dehydrogenase (AKR1C1) with X-ray crystallography and site-directed mutagenesis. Bioorg Med Chem Lett21:2564-7 (2011) 
 
Aldo-keto reductase family 1 member C1
Name:Aldo-keto reductase family 1 member C1
Type:Enzyme
Mol. Mass.:36793.97
Organism:Homo sapiens (Human)
Description:Recombinant AKR1C1 enzyme was expressed in E. coli.
Residue:323
BDBM50330427
NameBDBM50330427
Synonyms:5-Chloro-4-hydroxybiphenyl-3-carboxylic acid | CHEMBL1275703
TypeSmall organic molecule
Emp. Form.C13H9ClO3
Mol. Mass.248.662
SMILESOC(=O)c1cc(cc(Cl)c1O)-c1ccccc1