Reaction Details
TargetAldo-keto reductase family 1 member C1
LigandBDBM26269
Substrate/Competitorn/a
Meas. Tech.ChEMBL_741160 (CHEMBL1764482)
Ki 7.0±n/a nM
Citation El-Kabbani, ODhagat, USoda, MEndo, SMatsunaga, THara, A Probing the inhibitor selectivity pocket of human 20?-hydroxysteroid dehydrogenase (AKR1C1) with X-ray crystallography and site-directed mutagenesis. Bioorg Med Chem Lett21:2564-7 (2011) 
 
Aldo-keto reductase family 1 member C1
Name:Aldo-keto reductase family 1 member C1
Type:Enzyme
Mol. Mass.:36793.97
Organism:Homo sapiens (Human)
Description:Recombinant AKR1C1 enzyme was expressed in E. coli.
Residue:323
BDBM26269
NameBDBM26269
Synonyms:3,5-dichloro-2-hydroxybenzoic acid CHEMBL449129
TypeSmall organic molecule
Emp. Form.C7H4Cl2O3
Mol. Mass.207.011
SMILESOC(=O)c1cc(Cl)cc(Cl)c1O