Reaction Details
TargetReverse transcriptase
LigandBDBM27580
Substrate/Competitorn/a
Meas. Tech.ChEMBL_756685 (CHEMBL1805150)
IC50 300±n/a nM
Citation Butini, SGemma, SBrindisi, MBorrelli, GFiorini, ISamuele, AKarytinos, AFacchini, MLossani, AZanoli, SCampiani, GNovellino, EFocher, FMaga, G Enantioselective binding of second generation pyrrolobenzoxazepinones to the catalytic ternary complex of HIV-1 RT wild-type and L100I and K103N drug resistant mutants. Bioorg Med Chem Lett21:3935-8 (2011) 
 
Reverse transcriptase
Name:Reverse transcriptase
Synonyms:n/a
Type:Protein
Mol. Mass.:29598.37
Organism:Human immunodeficiency virus 1
Description:Q9WKE8
Residue:254
BDBM27580
NameBDBM27580
TypeSmall organic molecule
Emp. Form.C27H22ClNO3
Mol. Mass.443.921
SMILESCCC1(Oc2ccccc2-n2cccc2C1=O)c1ccc(COc2cccc(Cl)c2)cc1