Reaction Details
TargetSerine/threonine-protein kinase B-raf
LigandBDBM50484269
Substrate/Competitorn/a
Meas. Tech.ChEMBL_766931 (CHEMBL1828156)
IC50 82±n/a nM
Citation Holladay, MWCampbell, BTRowbottom, MWChao, QSprankle, KGLai, AGAbraham, SSetti, EFaraoni, RTran, LArmstrong, RCGunawardane, RNGardner, MFCramer, MDGitnick, DAtor, MADorsey, BDRuggeri, BRWilliams, MBhagwat, SSJames, J 4-Quinazolinyloxy-diaryl ureas as novel BRAFV600E inhibitors. Bioorg Med Chem Lett21:5342-6 (2011) 
 
Serine/threonine-protein kinase B-raf
Name:Serine/threonine-protein kinase B-raf
Type:Serine/threonine-protein kinase
Mol. Mass.:84446.00
Organism:Homo sapiens (Human)
Description:P15056
Residue:766
BDBM50484269
NameBDBM50484269
Synonyms:CHEMBL1824068
TypeSmall organic molecule
Emp. Form.C24H26N6O4
Mol. Mass.462.501
SMILESCOc1cc2ncnc(Nc3cccc(NC(=O)Nc4cc(on4)C(C)(C)C)c3)c2cc1OC