Reaction Details
TargetSerine/threonine-protein kinase B-raf
LigandBDBM333550
Substrate/Competitorn/a
Meas. Tech.ChEMBL_766931 (CHEMBL1828156)
IC50 110±n/a nM
Citation Holladay, MWCampbell, BTRowbottom, MWChao, QSprankle, KGLai, AGAbraham, SSetti, EFaraoni, RTran, LArmstrong, RCGunawardane, RNGardner, MFCramer, MDGitnick, DAtor, MADorsey, BDRuggeri, BRWilliams, MBhagwat, SSJames, J 4-Quinazolinyloxy-diaryl ureas as novel BRAFV600E inhibitors. Bioorg Med Chem Lett21:5342-6 (2011) 
 
Serine/threonine-protein kinase B-raf
Name:Serine/threonine-protein kinase B-raf
Type:Serine/threonine-protein kinase
Mol. Mass.:84446.00
Organism:Homo sapiens (Human)
Description:P15056
Residue:766
BDBM333550
NameBDBM333550
Synonyms:1-(5-tert- butylisoxazol- 3-yl)-3-(3- (7-hydroxy- 6- methoxy- quinazolin- 4- yloxy)phenyl) urea | US9730937, Example 95
TypeSmall organic molecule
Emp. Form.C23H23N5O5
Mol. Mass.449.4592
SMILESCOc1cc2c(Oc3cccc(NC(=O)Nc4cc(on4)C(C)(C)C)c3)ncnc2cc1O