Reaction Details
TargetSerine/threonine-protein kinase B-raf
LigandBDBM333504
Substrate/Competitorn/a
Meas. Tech.ChEMBL_766931 (CHEMBL1828156)
IC50 118±n/a nM
Citation Holladay, MWCampbell, BTRowbottom, MWChao, QSprankle, KGLai, AGAbraham, SSetti, EFaraoni, RTran, LArmstrong, RCGunawardane, RNGardner, MFCramer, MDGitnick, DAtor, MADorsey, BDRuggeri, BRWilliams, MBhagwat, SSJames, J 4-Quinazolinyloxy-diaryl ureas as novel BRAFV600E inhibitors. Bioorg Med Chem Lett21:5342-6 (2011) 
 
Serine/threonine-protein kinase B-raf
Name:Serine/threonine-protein kinase B-raf
Type:Serine/threonine-protein kinase
Mol. Mass.:84446.00
Organism:Homo sapiens (Human)
Description:P15056
Residue:766
BDBM333504
NameBDBM333504
Synonyms:1-(5-tert- butylisoxazol- 3-yl)-3-(3- (6,7- dimethoxy- quinazolin- 4-ylthio)phenyl) urea | US9730937, Example 46
TypeSmall organic molecule
Emp. Form.C24H25N5O4S
Mol. Mass.479.551
SMILESCOc1cc2ncnc(Sc3cccc(NC(=O)Nc4cc(on4)C(C)(C)C)c3)c2cc1OC