Reaction Details
TargetPeptidyl-prolyl cis-trans isomerase FKBP1B
LigandBDBM50029190
Substrate/Competitorn/a
Meas. Tech.ChEMBL_154486 (CHEMBL765263)
Ki 6±n/a nM
Citation Hu, MKBadger, ARich, DH Cyclosporin analogs modified in the 3,7,8-positions: substituent effects on peptidylprolyl isomerase inhibition and immunosuppressive activity are nonadditive. J Med Chem38:4164-70 (1995) Peptidyl-prolyl cis-trans isomerase FKBP1B
Name:Peptidyl-prolyl cis-trans isomerase FKBP1B
Type:PROTEIN
Mol. Mass.:11785.40
Organism:Homo sapiens (Human)
Description:ChEMBL_1458980
Residue:108
BDBM50029190
NameBDBM50029190
Synonyms:15-Benzyl-30-ethyl-33-(1-hydroxy-2-methyl-hex-4-enyl)-6,9,18,24-tetraisobutyl-3,21-diisopropyl-1,4,7,10,12,19,25,27,28-nonamethyl-1,4,7,10,13,16,19,22,25,28,31undecaaza-cyclotritriacontan-2,5,8,11,14,17,20,23,26,29,32-undecaone | CHEMBL2370706
TypeSmall organic molecule
Emp. Form.C69H117N11O12
Mol. Mass.1292.7338
SMILES[H][C@]1(C(C)C)N(C)C(=O)[C@H](CC(C)C)N(C)C(=O)[C@@H](CC(C)C)N(C)C(=O)[C@@H](C)NC(=O)[C@@H](Cc2ccccc2)NC(=O)[C@@H](CC(C)C)N(C)C(=O)[C@@H](NC(=O)[C@H](CC(C)C)N(C)C(=O)[C@@H](C)N(C)C(=O)[C@H](CC)NC(=O)[C@H](C(O)C(C)C\C=C\C)N(C)C1=O)C(C)C