Reaction Details
TargetTumor necrosis factor receptor superfamily member 16
LigandBDBM50029497
Substrate/Competitorn/a
Meas. Tech.ChEMBL_144433 (CHEMBL753643)
IC50 1300±n/a nM
Citation Jaen, JCLaborde, EBucsh, RACaprathe, BWSorenson, RJFergus, JSpiegel, KMarks, JDickerson, MRDavis, RE Kynurenic acid derivatives inhibit the binding of nerve growth factor (NGF) to the low-affinity p75 NGF receptor. J Med Chem38:4439-45 (1995) Tumor necrosis factor receptor superfamily member 16
Name:Tumor necrosis factor receptor superfamily member 16
Type:PROTEIN
Mol. Mass.:45159.83
Organism:Homo sapiens (Human)
Description:ChEMBL_346884
Residue:427
BDBM50029497
NameBDBM50029497
Synonyms:2-Methyl-7-oxo-5-(tetrazol-1-ylcarbamoyl)-4,7-dihydro-thieno[3,2-b]pyridine-3-carboxylic acid methyl ester | CHEMBL136617
TypeSmall organic molecule
Emp. Form.C12H10N6O4S
Mol. Mass.334.311
SMILESCOC(=O)c1c(C)sc2c(O)cc(nc12)C(=O)Nn1cnnn1