Reaction Details
TargetProstaglandin G/H synthase 2
LigandBDBM50029596
Substrate/Competitorn/a
Meas. Tech.ChEMBL_159606 (CHEMBL760088)
IC50 2±n/a nM
Citation Li, JJAnderson, GDBurton, EGCogburn, JNCollins, JTGarland, DJGregory, SAHuang, HCIsakson, PCKoboldt, CM 1,2-Diarylcyclopentenes as selective cyclooxygenase-2 inhibitors and orally active anti-inflammatory agents. J Med Chem38:4570-8 (1995) Prostaglandin G/H synthase 2
Name:Prostaglandin G/H synthase 2
Type:Enzyme
Mol. Mass.:69003.89
Organism:Homo sapiens (Human)
Description:Recombinant Cox-2 provided by Cayman (Cayman Chemical Co.,Ann Arbor, MI).
Residue:604
BDBM50029596
NameBDBM50029596
Synonyms:4-(2-Benzo[1,3]dioxol-5-yl-cyclopent-1-enyl)-benzenesulfonamide CHEMBL424063
TypeSmall organic molecule
Emp. Form.C18H17NO4S
Mol. Mass.343.397
SMILESNS(=O)(=O)c1ccc(cc1)C1=C(CCC1)c1ccc2OCOc2c1