Reaction Details
TargetSigma non-opioid intracellular receptor 1
LigandBDBM50029787
Substrate/Competitorn/a
Meas. Tech.ChEMBL_201913 (CHEMBL880938)
Ki 1.71±n/a nM
Citation Bertha, CMVilner, BJMattson, MVBowen, WDBecketts, KXu, HRothman, RBFlippen-Anderson, JLRice, KC (E)-8-benzylidene derivatives of 2-methyl-5-(3-hydroxyphenyl)morphans: highly selective ligands for the sigma 2 receptor subtype. J Med Chem38:4776-85 (1996) Sigma non-opioid intracellular receptor 1
Name:Sigma non-opioid intracellular receptor 1
Type:Enzyme Catalytic Domain
Mol. Mass.:25124.85
Organism:Homo sapiens (Human)
Description:Q99720
Residue:223
BDBM50029787
NameBDBM50029787
Synonyms:5-(3-Hydroxy-phenyl)-8-[1-(4-iodo-phenyl)-meth-(E)-ylidene]-2-methyl-2-aza-bicyclo[3.3.1]nonan-7-one | CHEMBL145422
TypeSmall organic molecule
Emp. Form.C22H22INO2
Mol. Mass.459.3201
SMILESCN1CCC2(CC1C(=Cc1ccc(I)cc1)C(=O)C2)c1cccc(O)c1