Reaction Details
TargetType-1 angiotensin II receptor
LigandBDBM50241491
Substrate/Competitorn/a
Meas. Tech.ChEMBL_35272 (CHEMBL648577)
Ki>4±n/a nM
Citation Salimbeni, ACanevotti, RPaleari, FPoma, DCaliari, SFici, FCirillo, RRenzetti, ARSubissi, ABelvisi, L N-3-substituted pyrimidinones as potent, orally active, AT1 selective angiotensin II receptor antagonists. J Med Chem38:4806-20 (1996) Type-1 angiotensin II receptor
Name:Type-1 angiotensin II receptor
Type:PROTEIN
Mol. Mass.:41107.81
Organism:Bos taurus
Description:ChEMBL_36779
Residue:359
BDBM50241491
NameBDBM50241491
Synonyms:2-{4-Butyl-2-methyl-6-oxo-5-[2'-(1H-tetrazol-5-yl)-biphenyl-4-ylmethyl]-6H-pyrimidin-1-ylmethyl}-thiophene-3-carboxylic acid methyl ester | CHEMBL429847
TypeSmall organic molecule
Emp. Form.C30H30N6O3S
Mol. Mass.554.663
SMILESCCCCc1nc(C)n(Cc2sccc2C(=O)OC)c(=O)c1Cc1ccc(cc1)-c1ccccc1-c1nnn[nH]1