Reaction Details
TargetType-1 angiotensin II receptor
LigandBDBM50029905
Substrate/Competitorn/a
Meas. Tech.ChEMBL_35272 (CHEMBL648577)
Ki>4±n/a nM
Citation Salimbeni, ACanevotti, RPaleari, FPoma, DCaliari, SFici, FCirillo, RRenzetti, ARSubissi, ABelvisi, L N-3-substituted pyrimidinones as potent, orally active, AT1 selective angiotensin II receptor antagonists. J Med Chem38:4806-20 (1996) Type-1 angiotensin II receptor
Name:Type-1 angiotensin II receptor
Type:PROTEIN
Mol. Mass.:41107.81
Organism:Bos taurus
Description:ChEMBL_36779
Residue:359
BDBM50029905
NameBDBM50029905
Synonyms:4'-(2-Butyl-4-methyl-6-oxo-6H-pyrimidin-1-ylmethyl)-biphenyl-2-carboxylic acid | CHEMBL277003
TypeSmall organic molecule
Emp. Form.C23H24N2O3
Mol. Mass.376.4483
SMILESCCCCc1nc(C)cc(=O)n1Cc1ccc(cc1)-c1ccccc1C(O)=O