Reaction Details
TargetSubstance-P receptor
LigandBDBM21016
Substrate/Competitorn/a
Meas. Tech.ChEMBL_205573 (CHEMBL807906)
IC50 3.3±n/a nM
Citation MacLeod, AMCascieri, MAMerchant, KJSadowski, SHardwicke, SLewis, RTMacIntyre, DEMetzger, JMFong, TMShepheard, S Synthesis and biological evaluation of NK1 antagonists derived from L-tryptophan. J Med Chem38:934-41 (1995) Substance-P receptor
Name:Substance-P receptor
Type:G Protein-Coupled Receptor (GPCR)
Mol. Mass.:46254.43
Organism:Homo sapiens (Human)
Description:P25103
Residue:407
BDBM21016
NameBDBM21016
Synonyms:CHEMBL22870 L-732,138 N-acetyltryptophan 3,5-bis(trifluoromethyl)benzyl ester | [3,5-bis(trifluoromethyl)phenyl]methyl (2S)-2-acetamido-3-(1H-indol-3-yl)propanoate
TypeSmall organic molecule
Emp. Form.C22H18F6N2O3
Mol. Mass.472.3803
SMILESCC(=O)N[C@@H](Cc1c[nH]c2ccccc12)C(=O)OCc1cc(cc(c1)C(F)(F)F)C(F)(F)F