Reaction Details
TargetSubstance-P receptor
LigandBDBM50030431
Substrate/Competitorn/a
Meas. Tech.ChEMBL_205571 (CHEMBL807904)
IC50 0.3±n/a nM
Citation MacLeod, AMCascieri, MAMerchant, KJSadowski, SHardwicke, SLewis, RTMacIntyre, DEMetzger, JMFong, TMShepheard, S Synthesis and biological evaluation of NK1 antagonists derived from L-tryptophan. J Med Chem38:934-41 (1995) Substance-P receptor
Name:Substance-P receptor
Type:G Protein-Coupled Receptor (GPCR)
Mol. Mass.:46254.43
Organism:Homo sapiens (Human)
Description:P25103
Residue:407
BDBM50030431
NameBDBM50030431
Synonyms:CHEMBL176500 | N-[(S)-4-(3,5-Bis-trifluoromethyl-phenyl)-1-(1H-indol-3-ylmethyl)-2-oxo-butyl]-4-pyrrolidin-1-yl-butyramide
TypeSmall organic molecule
Emp. Form.C29H31F6N3O2
Mol. Mass.567.5658
SMILESFC(F)(F)c1cc(CCC(=O)[C@H](Cc2c[nH]c3ccccc23)NC(=O)CCCN2CCCC2)cc(c1)C(F)(F)F