Reaction Details
TargetAlpha-2B adrenergic receptor
LigandBDBM50031301
Substrate/Competitorn/a
Meas. Tech.ChEMBL_33501 (CHEMBL647000)
Ki 152±n/a nM
Citation Cordi, AALacoste, JMDescombes, JJCourchay, CVanhoutte, PMLaubie, MVerbeuren, TJ Design, synthesis, and structure-activity relationships of a new series of alpha-adrenergic agonists: spiro[(1,3-diazacyclopent-1-ene)-5,2'-(1',2',3',4'- tetrahydronaphthalene)]. J Med Chem38:4056-69 (1995) Alpha-2B adrenergic receptor
Name:Alpha-2B adrenergic receptor
Type:Enzyme Catalytic Domain
Mol. Mass.:50379.83
Organism:NEONATAL RAT
Description:adrenergic Alpha2B ADRA2B NEONATAL RAT::P19328
Residue:453
BDBM50031301
NameBDBM50031301
Synonyms:8'-fluorospiro[4,5-dihydro-1H-imidazole-4,2'-(1',2',3',4'-tetrahydronaphthalene)] | CHEMBL131220
TypeSmall organic molecule
Emp. Form.C12H13FN2
Mol. Mass.204.2434
SMILESFc1cccc2CCC3(CNC=N3)Cc12