Reaction Details
TargetAlpha-2A adrenergic receptor
LigandBDBM50031319
Substrate/Competitorn/a
Meas. Tech.ChEMBL_33073 (CHEMBL648169)
Ki 34±n/a nM
Citation Cordi, AALacoste, JMDescombes, JJCourchay, CVanhoutte, PMLaubie, MVerbeuren, TJ Design, synthesis, and structure-activity relationships of a new series of alpha-adrenergic agonists: spiro[(1,3-diazacyclopent-1-ene)-5,2'-(1',2',3',4'- tetrahydronaphthalene)]. J Med Chem38:4056-69 (1995) Alpha-2A adrenergic receptor
Name:Alpha-2A adrenergic receptor
Type:Enzyme
Mol. Mass.:48979.91
Organism:Homo sapiens (Human)
Description:P08913
Residue:465
BDBM50031319
NameBDBM50031319
Synonyms:CHEMBL130853 | spiro[4,5-dihydro-1H-imidazole-4,2'-(1',2',3',4'-tetrahydronaphthalene)]
TypeSmall organic molecule
Emp. Form.C12H14N2
Mol. Mass.186.253
SMILESC1NC=NC11CCc2ccccc2C1