Reaction Details
TargetRetinoic acid receptor alpha
LigandBDBM50407395
Substrate/Competitorn/a
Meas. Tech.ChEMBL_195185 (CHEMBL802718)
IC50>1000±n/a nM
Citation Alam, MZhestkov, VSani, BPVenepally, PLevin, AAKazmer, SLi, ENorris, AWZhang, XKLee, MO Conformationally defined 6-s-trans-retinoic acid analogs. 2. Selective agonists for nuclear receptor binding and transcriptional activity. J Med Chem38:2302-10 (1995) Retinoic acid receptor alpha
Name:Retinoic acid receptor alpha
Type:PROTEIN
Mol. Mass.:50742.79
Organism:Mus musculus
Description:ChEMBL_195182
Residue:462
BDBM50407395
NameBDBM50407395
Synonyms:CHEMBL2111557
TypeSmall organic molecule
Emp. Form.C23H32O2
Mol. Mass.340.499
SMILESCCC1=C(C(C)C)\C(CCC1)=C\C(\C)=C/C=C/C=C/C(=C/C)/C(O)=O