Reaction Details
TargetRetinoic acid receptor gamma
LigandBDBM50031458
Substrate/Competitorn/a
Meas. Tech.ChEMBL_196164 (CHEMBL804937)
IC50 60±n/a nM
Citation Alam, MZhestkov, VSani, BPVenepally, PLevin, AAKazmer, SLi, ENorris, AWZhang, XKLee, MO Conformationally defined 6-s-trans-retinoic acid analogs. 2. Selective agonists for nuclear receptor binding and transcriptional activity. J Med Chem38:2302-10 (1995) Retinoic acid receptor gamma
Name:Retinoic acid receptor gamma
Type:PROTEIN
Mol. Mass.:50896.02
Organism:Mus musculus
Description:ChEMBL_196161
Residue:458
BDBM50031458
NameBDBM50031458
Synonyms:(2Z,5E)-7-Methyl-3-[(E)-2-(2,6,6-trimethyl-cyclohex-1-enyl)-vinyl]-nona-2,5-dienoic acid | CHEMBL75548
TypeSmall organic molecule
Emp. Form.C21H32O2
Mol. Mass.316.4776
SMILESCCC(C)\C=C\C\C(\C=C\C1=C(C)CCCC1(C)C)=C\C(O)=O