Reaction Details
TargetChymotrypsinogen A
LigandBDBM50031709
Substrate/Competitorn/a
Meas. Tech.ChEMBL_49466 (CHEMBL657110)
IC50>100000±n/a nM
Citation Senokuchi, KNakai, HNakayama, YOdagaki, YSakaki, KKato, MMaruyama, TMiyazaki, TIto, HKamiyasu, K New orally active serine protease inhibitors. J Med Chem38:2521-3 (1995) Chymotrypsinogen A
Name:Chymotrypsinogen A
Type:Serine protease
Mol. Mass.:25670.88
Organism:Bos taurus (bovine)
Description:n/a
Residue:245
BDBM50031709
NameBDBM50031709
Synonyms:4-Guanidino-benzoic acid 4-carboxymethyl-phenyl ester; compound with methanesulfonic acid | CHEMBL433135
TypeSmall organic molecule
Emp. Form.C16H15N3O4
Mol. Mass.313.308
SMILES[#7]\[#6](-[#7])=[#7]/c1ccc(cc1)-[#6](=O)-[#8]-c1ccc(-[#6]-[#6](-[#8])=O)cc1