Reaction Details
TargetEndothelin-1 receptor
LigandBDBM50032166
Substrate/Competitorn/a
Meas. Tech.ChEMBL_63185 (CHEMBL677396)
IC50 910.0±n/a nM
Citation Cody, WLHe, JXDePue, PLWaite, LALeonard, DMSefler, AMKaltenbronn, JSHaleen, SJWalker, DMFlynn, MA Structure-activity relationships of the potent combined endothelin-A/endothelin-B receptor antagonist Ac-DDip16-Leu-Asp-Ile-Ile-Trp21: development of endothelin-B receptor selective antagonists. J Med Chem38:2809-19 (1995) Endothelin-1 receptor
Name:Endothelin-1 receptor
Type:Enzyme Catalytic Domain
Mol. Mass.:48736.88
Organism:Homo sapiens (Human)
Description:P25101
Residue:427
BDBM50032166
NameBDBM50032166
Synonyms:(S)-3-[(S)-2-((S)-2-Acetylamino-3-phenyl-propionylamino)-3-phenyl-propionylamino]-N-((1S,2S)-1-{(1S,2S)-1-[(S)-1-carboxy-2-(1H-indol-3-yl)-ethylcarbamoyl]-2-methyl-butylcarbamoyl}-2-methyl-butyl)-succinamic acid | CHEMBL317099
TypeSmall organic molecule
Emp. Form.C47H59N7O10
Mol. Mass.882.0123
SMILESCC[C@H](C)[C@H](NC(=O)[C@H](CC(O)=O)NC(=O)[C@H](Cc1ccccc1)NC(=O)[C@H](Cc1ccccc1)NC(C)=O)C(=O)N[C@@H]([C@@H](C)CC)C(=O)N[C@@H](Cc1c[nH]c2ccccc12)C(O)=O