Reaction Details
Target5-hydroxytryptamine receptor 1A
LigandBDBM50035317
Substrate/Competitorn/a
Meas. Tech.ChEMBL_1471 (CHEMBL616594)
Ki 1.5±n/a nM
Citation Stjernlöf, PEnnis, MDHansson, LOHoffman, RLGhazal, NBSundell, SSmith, MWSvensson, KCarlsson, AWikström, H Structure-activity relationships in the 8-amino-6,7,8,9-tetrahydro-3H-benz[e]indole ring system. 1. Effects of substituents in the aromatic system on serotonin and dopamine receptor subtypes. J Med Chem38:2202-16 (1995) 5-hydroxytryptamine receptor 1A
Name:5-hydroxytryptamine receptor 1A
Type:G Protein-Coupled Receptor (GPCR)
Mol. Mass.:46445.29
Organism:Rattus norvegicus (rat)
Description:Binding assays were performed using rat hippocampal membranes.
Residue:422
BDBM50035317
NameBDBM50035317
Synonyms:((R)-4-Fluoro-6,7,8,9-tetrahydro-3H-benzo[e]indol-8-yl)-dipropyl-amine | CHEMBL70710
TypeSmall organic molecule
Emp. Form.C18H25FN2
Mol. Mass.288.4029
SMILESCCCN(CCC)[C@@H]1CCc2cc(F)c3[nH]ccc3c2C1