Reaction Details
TargetD(2) dopamine receptor
LigandBDBM50035317
Substrate/Competitorn/a
Meas. Tech.ChEMBL_63066 (CHEMBL673633)
Ki 7.8±n/a nM
Citation Stjernlöf, PEnnis, MDHansson, LOHoffman, RLGhazal, NBSundell, SSmith, MWSvensson, KCarlsson, AWikström, H Structure-activity relationships in the 8-amino-6,7,8,9-tetrahydro-3H-benz[e]indole ring system. 1. Effects of substituents in the aromatic system on serotonin and dopamine receptor subtypes. J Med Chem38:2202-16 (1995) D(2) dopamine receptor
Name:D(2) dopamine receptor
Type:G Protein-Coupled Receptor (GPCR)
Mol. Mass.:50931.60
Organism:Rattus norvegicus (rat)
Description:P61169
Residue:444
BDBM50035317
NameBDBM50035317
Synonyms:((R)-4-Fluoro-6,7,8,9-tetrahydro-3H-benzo[e]indol-8-yl)-dipropyl-amine | CHEMBL70710
TypeSmall organic molecule
Emp. Form.C18H25FN2
Mol. Mass.288.4029
SMILESCCCN(CCC)[C@@H]1CCc2cc(F)c3[nH]ccc3c2C1