Reaction Details
Target5-hydroxytryptamine receptor 1D
LigandBDBM50035313
Substrate/Competitorn/a
Meas. Tech.ChEMBL_1999 (CHEMBL617092)
Ki 8.6±n/a nM
Citation Stjernlöf, PEnnis, MDHansson, LOHoffman, RLGhazal, NBSundell, SSmith, MWSvensson, KCarlsson, AWikström, H Structure-activity relationships in the 8-amino-6,7,8,9-tetrahydro-3H-benz[e]indole ring system. 1. Effects of substituents in the aromatic system on serotonin and dopamine receptor subtypes. J Med Chem38:2202-16 (1995) 5-hydroxytryptamine receptor 1D
Name:5-hydroxytryptamine receptor 1D
Type:G Protein-Coupled Receptor (GPCR)
Mol. Mass.:41920.63
Organism:Homo sapiens (Human)
Description:Receptor binding assays were performed using human clone stably expressed in CHO cells.
Residue:377
BDBM50035313
NameBDBM50035313
Synonyms:8-Dipropylamino-4-fluoro-6,7,8,9-tetrahydro-3H-benzo[e]indole-1-carbonitrile | CHEMBL71474
TypeSmall organic molecule
Emp. Form.C19H24FN3
Mol. Mass.313.4124
SMILESCCCN(CCC)C1CCc2cc(F)c3[nH]cc(C#N)c3c2C1