Reaction Details
TargetThromboxane-A synthase
LigandBDBM50036354
Substrate/Competitorn/a
Meas. Tech.ChEMBL_210278 (CHEMBL808525)
IC50 20±n/a nM
Citation Faull, AWBrewster, AGBrown, GRSmithers, MJJackson, R Dual-acting thromboxane receptor antagonist/synthase inhibitors: synthesis and biological properties of [2-substituted-4-(3-pyridyl)-1,3-dioxan-5-yl] alkenoic acids. J Med Chem38:686-94 (1995) Thromboxane-A synthase
Name:Thromboxane-A synthase
Type:Enzyme
Mol. Mass.:60524.67
Organism:Homo sapiens (Human)
Description:P24557
Residue:533
BDBM50036354
NameBDBM50036354
Synonyms:(Z)-6-{2-[1-(4-Fluoro-2-nitro-phenoxy)-1-methyl-ethyl]-4-pyridin-3-yl-[1,3]dioxan-5-yl}-hex-4-enoic acid | CHEMBL159243
TypeSmall organic molecule
Emp. Form.C24H27FN2O7
Mol. Mass.474.4788
SMILESCC(C)(Oc1ccc(F)cc1[N+]([O-])=O)C1OCC(C\C=C/CCC(O)=O)C(O1)c1cccnc1