Reaction Details
TargetSigma non-opioid intracellular receptor 1
LigandBDBM50007400
Substrate/Competitorn/a
Meas. Tech.ChEMBL_226542 (CHEMBL846482)
Ki 1±n/a nM
Citation Schuster, DIPan, YPSingh, GStoupakis, GCai, BLem, GEhrlich, GKFrietze, WMurphy, RB N-(1-arylpropionyl)-4-aryltetrahydropyridines, a new class of high-affinity selective sigma receptor ligands. J Med Chem36:3923-8 (1994) Sigma non-opioid intracellular receptor 1
Name:Sigma non-opioid intracellular receptor 1
Type:Enzyme Catalytic Domain
Mol. Mass.:25124.85
Organism:Homo sapiens (Human)
Description:Q99720
Residue:223
BDBM50007400
NameBDBM50007400
Synonyms:4-Phenyl-1-(4-phenyl-butyl)-piperidine CHEMBL1788131 | CHEMBL325238
TypeSmall organic molecule
Emp. Form.C21H27N
Mol. Mass.293.4458
SMILESC(CCc1ccccc1)CN1CCC(CC1)c1ccccc1