Reaction Details
TargetMitogen-activated protein kinase 10/8/9
LigandBDBM102562
Substrate/Competitorn/a
Meas. Tech.ChEMBL_965794 (CHEMBL2393733)
IC50 820±n/a nM
Citation Gong, LHan, XSilva, TTan, YCGoyal, BTivitmahaisoon, PTrejo, APalmer, WHogg, HJahagir, AAlam, MWagner, PStein, KFilonova, LLoe, BMakra, FRotstein, DRapatova, LDunn, JZuo, FDal Porto, JWong, BJin, SChang, ATran, PHsieh, GNiu, LShao, AReuter, DHermann, JKuglstatter, AGoldstein, D Development of indole/indazole-aminopyrimidines as inhibitors of c-Jun N-terminal kinase (JNK): optimization for JNK potency and physicochemical properties. Bioorg Med Chem Lett23:3565-9 (2013) 
 
Mitogen-activated protein kinase 10/8/9
Name:Mitogen-activated protein kinase 10/8/9
Synonyms:c-Jun N-terminal kinase, JNK
Type:n/a
Mol. Mass.:n/a
Description:ASSAY_ID of ChEMBL is 216672
Components:This complex has 3 components.
Component 1
Name:Mitogen-activated protein kinase 8
Type:Enzyme
Mol. Mass.:48297.57
Organism:Homo sapiens (Human)
Description:JNK-1 was purchased from Upstate Cell Signaling Solutions (formerly Upstate Biotechnology).
Residue:427
Component 2
Name:Mitogen-activated protein kinase 10
Synonyms:JNK3 MAP kinase p49 3F12 MK10_HUMAN Mitogen-activated protein kinase 10 (Stress-activated protein kinase JNK3) (c-Jun N-terminal kinase 3) (MAP kinase p49 3F12) PRKM10 Stress-activated protein kinase JNK3 | c-Jun N-terminal kinase 3 (JNK3)
Type:Enzyme
Mol. Mass.:52586.89
Organism:Homo sapiens (Human)
Description:n/a
Residue:464
Component 3
Name:Mitogen-activated protein kinase 9
Synonyms:JNK-55 JNK2/JNK3 MK09_HUMAN Mitogen-activated protein kinase 8/9 SAPK1A c-Jun N-terminal kinase 2 | c-Jun N-terminal kinase 2 (JNK2)
Type:Enzyme
Mol. Mass.:48131.49
Organism:Homo sapiens (Human)
Description:JNK-2 was purchased from Upstate Cell Signaling Solutions (formerly Upstate Biotechnology).
Residue:424
BDBM102562
NameBDBM102562
Synonyms:US8536172, I-11
TypeSmall organic molecule
Emp. Form.C25H33N7O4S
Mol. Mass.527.639
SMILESCS(=O)(=O)N[C@H]1CC[C@@H](CC1)Nc1nccc(n1)-n1ccc2c(cccc12)N1CCN(CC1)C(=O)CO